Target
Proto-oncogene tyrosine-protein kinase receptor Ret
Ligand
BDBM345847
Substrate
Meas. Tech.
RET Wild Type Assay at KM
IC50
<10±n/a nM
Citation
 Brooijmans, NDiPietro, LVFleming, PEKim, JLWenglowsky, SMZhang, Y 2-(pyridin-3-yl)-pyrimidine derivatives as RET inhibitors US Patent  US10202365 Publication Date 2/12/2019 
Target
Name:
Proto-oncogene tyrosine-protein kinase receptor Ret
Synonyms:
CDHF12 Cadherin family member 12 Proto-oncogene c-Ret RET51 Tyrosine-protein kinase Ret (RET)
Type:
Protein
Mol. Mass.:
124318.29
Organism:
Homo sapiens (Human)
Description:
P07949
Residue:
1114
  
Inhibitor
Name:
BDBM345847
Synonyms:
US10202365, Compound 24 | US10774070, Compound 24
Type:
Small organic molecule
Emp. Form.:
C26H26N10O
Mol. Mass.:
494.551
SMILES:
Cc1cc(C)n(n1)-c1ccc(CNC(=O)c2ccc(cn2)-c2nc(C)cc(Nc3cc(C)[nH]n3)n2)cn1
: