Target
cAMP and cAMP-inhibited cGMP 3',5'-cyclic phosphodiesterase 10A [432-779]
Ligand
BDBM14773
Substrate
BDBM10851
Meas. Tech.
Phosphodiesterase (PDE) Inhibition Assay
IC50
73000±n/a nM
Citation
 Card, GLEngland, BPSuzuki, YFong, DPowell, BLee, BLuu, CTabrizizad, MGillette, SIbrahim, PNArtis, DRBollag, GMilburn, MVKim, SHSchlessinger, JZhang, KY Structural basis for the activity of drugs that inhibit phosphodiesterases. Structure 12:2233-47 (2004)  
Target
Name:
cAMP and cAMP-inhibited cGMP 3',5'-cyclic phosphodiesterase 10A [432-779]
Synonyms:
PDE10A Phosphodiesterase Type 10 (PDE10A) | cAMP and cAMP-inhibited cGMP 3,5-cyclic phosphodiesterase 10A
Type:
Enzyme Catalytic Domain
Mol. Mass.:
40036.62
Organism:
Homo sapiens (Human)
Description:
Recombinant catalytic domain (M432-D779) of human PDE10A.
Residue:
348
  
Inhibitor
Name:
BDBM14773
Synonyms:
4-cyano-4-(3-cyclopentyloxy-4-methoxy-phenyl)cyclohexane-1-carboxylic acid Ariflo SB207499
Type:
Small organic molecule
Emp. Form.:
C20H25NO4
Mol. Mass.:
343.4168
SMILES:
COc1ccc(cc1OC1CCCC1)C1(CCC(CC1)C(O)=O)C#N
:
Substrate
Name:
BDBM10851
Synonyms:
(4aR,6R,7R,7aS)-6-(6-amino-9H-purin-9-yl)-2,7-dihydroxy-hexahydro-1,3,5,2-furo[3,2-d][1,3,2]dioxaphosphinin-2-one ADENOSINE-3 ,5 -CYCLIC-MONOPHOSPHATE cAMP | cid_23902375
Type:
Small organic molecule
Emp. Form.:
C10H12N5O6P
Mol. Mass.:
329.2059
SMILES:
Nc1ncnc2n(cnc12)[C@@H]1O[C@@H]2COP(O)(=O)O[C@H]2[C@H]1O
: