Target
Genome polyprotein
Ligand
BDBM345864
Substrate
Meas. Tech.
Huh 7.5.1 ATPlite assay
EC50
400±n/a nM
Citation
 Liang, THu, ZMarugan, JJSouthall, NTHe, SHu, XXiao, JFerrer, MZheng, WFrankowski, KJSchoenen, FJLi, K Heterocyclic compounds and methods of use thereof US Patent  US10202367 Publication Date 2/12/2019 
Target
Name:
Genome polyprotein
Synonyms:
HCV | POLG_HCVJ6
Type:
Protein
Mol. Mass.:
329229.59
Organism:
Hepatitis C virus genotype 2a (isolate HC-J6) (HCV)
Description:
P26660
Residue:
3033
  
Inhibitor
Name:
BDBM345864
Synonyms:
US10202367, Compound 10
Type:
Small organic molecule
Emp. Form.:
C27H42N4O2
Mol. Mass.:
454.648
SMILES:
CC1OC(=NC1CN1CCC(CC1)C(=O)NCCCN1CCC(C)CC1)c1ccccc1C
: