Target
Genome polyprotein
Ligand
BDBM345888
Substrate
Meas. Tech.
Huh 7.5.1 ATPlite assay
EC50
93.0±n/a nM
Citation
 Liang, THu, ZMarugan, JJSouthall, NTHe, SHu, XXiao, JFerrer, MZheng, WFrankowski, KJSchoenen, FJLi, K Heterocyclic compounds and methods of use thereof US Patent  US10202367 Publication Date 2/12/2019 
Target
Name:
Genome polyprotein
Synonyms:
HCV | POLG_HCVJ6
Type:
Protein
Mol. Mass.:
329229.59
Organism:
Hepatitis C virus genotype 2a (isolate HC-J6) (HCV)
Description:
P26660
Residue:
3033
  
Inhibitor
Name:
BDBM345888
Synonyms:
US10202367, Compound 34
Type:
Small organic molecule
Emp. Form.:
C29H46N4O2
Mol. Mass.:
482.7011
SMILES:
CC1OC(=NC1CN1CCC(CC1)C(=O)NCCCN1C[C@@H](C)C[C@@H](C)C1)c1cc(C)ccc1C
: