Target
P2X purinoceptor 3
Ligand
BDBM319914
Substrate
Meas. Tech.
Intracellular Calcium Measurement to Assess Antagonist Activity
IC50
3.00±n/a nM
Citation
 Davenport, AJBräuer, NFischer, OMRotgeri, ARottmann, ANeagoe, INagel, JGodinho-Coelho, AKlar, J 1,3-thiazol-2-yl substituted benzamides US Patent  US10202369 Publication Date 2/12/2019 
Target
Name:
P2X purinoceptor 3
Synonyms:
ATP receptor P2RX3 P2X purinoceptor 3 P2X purinoceptor 3 (P2X3) P2X3 purinoceptor p2x3 + hsa
Type:
Protein
Mol. Mass.:
44292.02
Organism:
Homo sapiens (Human)
Description:
P56373
Residue:
397
  
Inhibitor
Name:
BDBM319914
Synonyms:
N-[1-(5- Chloro-3- fluoropyridin- 2-yl)ethyl]-3- (5-methyl- 1,3-thiazol-2- yl)-5- (tetrahydro- 2H-pyran-4- yloxy) benzamide US10202369, Example 81 | US10472354, Example 81
Type:
Small organic molecule
Emp. Form.:
C23H23ClFN3O3S
Mol. Mass.:
475.963
SMILES:
CC(NC(=O)c1cc(OC2CCOCC2)cc(c1)-c1ncc(C)s1)c1ncc(Cl)cc1F
: