Target
P2X purinoceptor 3
Ligand
BDBM320102
Substrate
Meas. Tech.
Intracellular Calcium Measurement to Assess Antagonist Activity
IC50
2.00±n/a nM
Citation
 Davenport, AJBräuer, NFischer, OMRotgeri, ARottmann, ANeagoe, INagel, JGodinho-Coelho, AKlar, J 1,3-thiazol-2-yl substituted benzamides US Patent  US10202369 Publication Date 2/12/2019 
Target
Name:
P2X purinoceptor 3
Synonyms:
ATP receptor P2RX3 P2X purinoceptor 3 P2X purinoceptor 3 (P2X3) P2X3 purinoceptor p2x3 + hsa
Type:
Protein
Mol. Mass.:
44292.02
Organism:
Homo sapiens (Human)
Description:
P56373
Residue:
397
  
Inhibitor
Name:
BDBM320102
Synonyms:
3-(5-ethyl-1,3- thiazol-2-yl)-5- [(2R)- tetrahydrofuran-2- ylmethoxy]-N- {(1R)-1-[2- (trifluoromethyl) pyrimidin-5- yl]ethyl}benzamide US10202369, Example 278
Type:
Small organic molecule
Emp. Form.:
C24H25F3N4O3S
Mol. Mass.:
506.541
SMILES:
CCc1cnc(s1)-c1cc(OC[C@H]2CCCO2)cc(c1)C(=O)N[C@H](C)c1cnc(nc1)C(F)(F)F
: