Target
P2X purinoceptor 3
Ligand
BDBM320206
Substrate
Meas. Tech.
Intracellular Calcium Measurement to Assess Antagonist Activity
IC50
21.0±n/a nM
Citation
 Davenport, AJBräuer, NFischer, OMRotgeri, ARottmann, ANeagoe, INagel, JGodinho-Coelho, AKlar, J 1,3-thiazol-2-yl substituted benzamides US Patent  US10202369 Publication Date 2/12/2019 
Target
Name:
P2X purinoceptor 3
Synonyms:
ATP receptor P2RX3 P2X purinoceptor 3 P2X purinoceptor 3 (P2X3) P2X3 purinoceptor p2x3 + hsa
Type:
Protein
Mol. Mass.:
44292.02
Organism:
Homo sapiens (Human)
Description:
P56373
Residue:
397
  
Inhibitor
Name:
BDBM320206
Synonyms:
3-{[(2R)-4- methylmorpholin- 2-yl]methoxy}-5- (5-methyl-1,3- thiazol-2-yl)- N-{(1R)-1-[6- (trifluoromethyl) pyridazin-3- yl]ethyl} benzamide US10202369, Example 373 | US10472354, Example 373
Type:
Small organic molecule
Emp. Form.:
C24H26F3N5O3S
Mol. Mass.:
521.555
SMILES:
C[C@@H](NC(=O)c1cc(OC[C@H]2CN(C)CCO2)cc(c1)-c1ncc(C)s1)c1ccc(nn1)C(F)(F)F
: