Target
P2X purinoceptor 3
Ligand
BDBM322574
Substrate
Meas. Tech.
Intracellular Calcium Measurement to Assess Antagonist Activity
IC50
3.00±n/a nM
Citation
 Davenport, AJBräuer, NFischer, OMRotgeri, ARottmann, ANeagoe, INagel, JGodinho-Coelho, AKlar, J 1,3-thiazol-2-yl substituted benzamides US Patent  US10202369 Publication Date 2/12/2019 
Target
Name:
P2X purinoceptor 3
Synonyms:
ATP receptor P2RX3 P2X purinoceptor 3 P2X purinoceptor 3 (P2X3) P2X3 purinoceptor p2x3 + hsa
Type:
Protein
Mol. Mass.:
44292.02
Organism:
Homo sapiens (Human)
Description:
P56373
Residue:
397
  
Inhibitor
Name:
BDBM322574
Synonyms:
US10183937, Example 385 | US10202369, Example 385
Type:
Small organic molecule
Emp. Form.:
C25H26F5N5O2S
Mol. Mass.:
555.563
SMILES:
C[C@H](NC(=O)c1cc(OCC2CN(C)CCC2(F)F)cc(c1)-c1ncc(C)s1)c1cnc(nc1)C(F)(F)F
: