Target
Mast/stem cell growth factor receptor Kit
Ligand
BDBM346100
Substrate
Meas. Tech.
In Vitro TK Inhibition Assay
EC50
<1000±n/a nM
Citation
 Moussy, ABenjahad, ASchalon, CPez, DChevenier, ESandrinelli, FMartin, JPicoul, W Benzimidazole derivatives as selective proteine kinase inhibitors US Patent  US10202370 Publication Date 2/12/2019 
Target
Name:
Mast/stem cell growth factor receptor Kit
Synonyms:
CD117 antigen KIT Mast/stem cell growth factor receptor Kit (cKIT) Proto-oncogene tyrosine-protein kinase Kit Stem cell growth factor receptor Tyrosine-protein kinase Kit c-kit v-kit Hardy-Zuckerman 4 feline sarcoma viral oncogene homolog
Type:
Protein
Mol. Mass.:
109869.37
Organism:
Homo sapiens (Human)
Description:
P10721
Residue:
976
  
Inhibitor
Name:
BDBM346100
Synonyms:
US10202370, Example 146 | [2-(3-Ethynyl- phenyl)-1,6- dimethyl-1H- benzoimidazol-5-yl]- (4-pyridin-3-yl- thiazol-2-yl)-amine
Type:
Small organic molecule
Emp. Form.:
C25H19N5S
Mol. Mass.:
421.517
SMILES:
Cc1cc2n(C)c(nc2cc1Nc1nc(cs1)-c1cccnc1)-c1cccc(c1)C#C
: