Target
Mast/stem cell growth factor receptor Kit
Ligand
BDBM346119
Substrate
Meas. Tech.
In Vitro TK Inhibition Assay
EC50
5500±n/a nM
Citation
 Moussy, ABenjahad, ASchalon, CPez, DChevenier, ESandrinelli, FMartin, JPicoul, W Benzimidazole derivatives as selective proteine kinase inhibitors US Patent  US10202370 Publication Date 2/12/2019 
Target
Name:
Mast/stem cell growth factor receptor Kit
Synonyms:
CD117 antigen KIT Mast/stem cell growth factor receptor Kit (cKIT) Proto-oncogene tyrosine-protein kinase Kit Stem cell growth factor receptor Tyrosine-protein kinase Kit c-kit v-kit Hardy-Zuckerman 4 feline sarcoma viral oncogene homolog
Type:
Protein
Mol. Mass.:
109869.37
Organism:
Homo sapiens (Human)
Description:
P10721
Residue:
976
  
Inhibitor
Name:
BDBM346119
Synonyms:
US10202370, Example 016 | {2-[3-(2- Dimethylamino- ethoxy)-phenyl]-6- methyl-3H- benzoimidazo1-5-yl}- (4-pyridin-3-yl- pyrimidin-2-yl)- amine
Type:
Small organic molecule
Emp. Form.:
C27H27N7O
Mol. Mass.:
465.5496
SMILES:
CN(C)CCOc1cccc(c1)-c1nc2cc(C)c(Nc3nccc(n3)-c3cccnc3)cc2[nH]1
: