Target
Mast/stem cell growth factor receptor Kit
Ligand
BDBM346155
Substrate
Meas. Tech.
In Vitro TK Inhibition Assay
EC50
5500±n/a nM
Citation
 Moussy, ABenjahad, ASchalon, CPez, DChevenier, ESandrinelli, FMartin, JPicoul, W Benzimidazole derivatives as selective proteine kinase inhibitors US Patent  US10202370 Publication Date 2/12/2019 
Target
Name:
Mast/stem cell growth factor receptor Kit
Synonyms:
CD117 antigen KIT Mast/stem cell growth factor receptor Kit (cKIT) Proto-oncogene tyrosine-protein kinase Kit Stem cell growth factor receptor Tyrosine-protein kinase Kit c-kit v-kit Hardy-Zuckerman 4 feline sarcoma viral oncogene homolog
Type:
Protein
Mol. Mass.:
109869.37
Organism:
Homo sapiens (Human)
Description:
P10721
Residue:
976
  
Inhibitor
Name:
BDBM346155
Synonyms:
(4-Pyridin-3-yl- thiazol-2-yl)-[2-(3- trifluoromethyl- phenyl)-1H- benzoimidazol-5-yl]- amine | US10202370, Example 088
Type:
Small organic molecule
Emp. Form.:
C22H14F3N5S
Mol. Mass.:
437.44
SMILES:
FC(F)(F)c1cccc(c1)-c1nc2cc(Nc3nc(cs3)-c3cccnc3)ccc2[nH]1
: