Target
Mast/stem cell growth factor receptor Kit
Ligand
BDBM346167
Substrate
Meas. Tech.
In Vitro TK Inhibition Assay
EC50
5500±n/a nM
Citation
 Moussy, ABenjahad, ASchalon, CPez, DChevenier, ESandrinelli, FMartin, JPicoul, W Benzimidazole derivatives as selective proteine kinase inhibitors US Patent  US10202370 Publication Date 2/12/2019 
Target
Name:
Mast/stem cell growth factor receptor Kit
Synonyms:
CD117 antigen KIT Mast/stem cell growth factor receptor Kit (cKIT) Proto-oncogene tyrosine-protein kinase Kit Stem cell growth factor receptor Tyrosine-protein kinase Kit c-kit v-kit Hardy-Zuckerman 4 feline sarcoma viral oncogene homolog
Type:
Protein
Mol. Mass.:
109869.37
Organism:
Homo sapiens (Human)
Description:
P10721
Residue:
976
  
Inhibitor
Name:
BDBM346167
Synonyms:
Ethenesulfonic acid {3-[1,6-dimethyl-5- (4-pyridin-4-yl- thiazol-2-ylamino)- yl]-5-trifluoromethyl- phenyl}-amide | US10202370, Example 122
Type:
Small organic molecule
Emp. Form.:
C26H21F3N6O2S2
Mol. Mass.:
570.609
SMILES:
Cc1cc2n(C)c(nc2cc1Nc1nc(cs1)-c1ccncc1)-c1cc(NS(=O)(=O)C=C)cc(c1)C(F)(F)F
: