Target
Phosphatidylinositol 4,5-bisphosphate 3-kinase catalytic subunit gamma isoform
Ligand
BDBM346172
Substrate
IC50
5800±n/a nM
Citation
 Fairhurst, RAFuret, PKalthoff, FSLerchner, ARueeger, H Oxazolidin-2-one-pyrimidine derivatives and the use thereof as phosphatidylinositol-3-kinase inhibitors US Patent  US10202371 Publication Date 2/12/2019 
Target
Name:
Phosphatidylinositol 4,5-bisphosphate 3-kinase catalytic subunit gamma isoform
Synonyms:
PI3-kinase p110 subunit gamma PI3Kgamma PK3CG_HUMAN Phosphatidylinositol 4,5-bisphosphate 3-kinase (PI3K) Phosphatidylinositol 4,5-bisphosphate 3-kinase catalytic subunit gamma (PI3Kgamma) Phosphatidylinositol 4,5-bisphosphate 3-kinase catalytic subunit gamma isoform (PI3K) Phosphatidylinositol-4,5-bisphosphate 3-kinase catalytic subunit gamma isoform Phosphoinositide 3-kinases gamma (PI3K gamma) p120-PI3K
Type:
Enzyme Subunit
Mol. Mass.:
126470.30
Organism:
Homo sapiens (Human)
Description:
P48736
Residue:
1102
  
Inhibitor
Name:
BDBM346172
Synonyms:
(4S*,5S*)-3-(2′-amino-2-morpholino-4′-(trifluoromethyl)-[4,5′-bipyrimidin]-6-yl)-4-ethyl-5-(4-methoxyphenyl)oxazolidin-2-one | US10202371, Example 2
Type:
Small organic molecule
Emp. Form.:
C25H26F3N7O4
Mol. Mass.:
545.5136
SMILES:
CC[C@H]1[C@@H](OC(=O)N1c1cc(nc(n1)N1CCOCC1)-c1cnc(N)nc1C(F)(F)F)c1ccc(OC)cc1
: