Target
Serine/threonine-protein kinase mTOR
Ligand
BDBM346175
Substrate
Meas. Tech.
Biochemical Assay for mTOR
IC50
2250±n/a nM
Citation
 Fairhurst, RAFuret, PKalthoff, FSLerchner, ARueeger, H Oxazolidin-2-one-pyrimidine derivatives and the use thereof as phosphatidylinositol-3-kinase inhibitors US Patent  US10202371 Publication Date 2/12/2019 
Target
Name:
Serine/threonine-protein kinase mTOR
Synonyms:
FK506-binding protein 12-rapamycin complex-associated protein 1 FRAP FRAP1 MTOR Mammalian Target of Rapamycin (mTOR) RAFT1 Rapamycin and FKBP12 target 1 Serine/threonine-protein kinase (mTOR) | mTORC2
Type:
Rapamycin target protein
Mol. Mass.:
288917.12
Organism:
Homo sapiens (Human)
Description:
P42345
Residue:
2549
  
Inhibitor
Name:
BDBM346175
Synonyms:
US10202371, Example 5
Type:
Small organic molecule
Emp. Form.:
C23H22F3N7O3
Mol. Mass.:
501.4611
SMILES:
C[C@H]1[C@@H](OC(=O)N1c1cc(nc(n1)N1CCOCC1)-c1cnc(N)nc1C(F)(F)F)c1ccccc1
: