Target
Phosphatidylinositol 4,5-bisphosphate 3-kinase catalytic subunit alpha isoform
Ligand
BDBM346181
Substrate
Meas. Tech.
Cellular Assays for PI3Kalpha, Beta and Delta
IC50
32.0±n/a nM
Citation
 Fairhurst, RAFuret, PKalthoff, FSLerchner, ARueeger, H Oxazolidin-2-one-pyrimidine derivatives and the use thereof as phosphatidylinositol-3-kinase inhibitors US Patent  US10202371 Publication Date 2/12/2019 
Target
Name:
Phosphatidylinositol 4,5-bisphosphate 3-kinase catalytic subunit alpha isoform
Synonyms:
PI3-kinase subunit alpha PI3Kalpha Phosphatidylinositol 4,5-bisphosphate 3-kinase 110 kDa catalytic subunit alpha Pik3ca PtdIns-3-kinase subunit p110-alpha p110alpha
Type:
Enzyme Catalytic Domain
Mol. Mass.:
124363.80
Organism:
Rattus norvegicus (Rat)
Description:
A0A0G2K344
Residue:
1068
  
Inhibitor
Name:
BDBM346181
Synonyms:
US10202371, Example 11
Type:
Small organic molecule
Emp. Form.:
C20H19F3N8O3S
Mol. Mass.:
508.477
SMILES:
C[C@H]1[C@H](OC(=O)N1c1cc(nc(n1)N1CCOCC1)-c1cnc(N)nc1C(F)(F)F)c1nccs1
: