Target
Phosphatidylinositol 4,5-bisphosphate 3-kinase catalytic subunit alpha isoform
Ligand
BDBM346182
Substrate
Meas. Tech.
Cellular Assays for PI3Kalpha, Beta and Delta
IC50
63.0±n/a nM
Citation
 Fairhurst, RAFuret, PKalthoff, FSLerchner, ARueeger, H Oxazolidin-2-one-pyrimidine derivatives and the use thereof as phosphatidylinositol-3-kinase inhibitors US Patent  US10202371 Publication Date 2/12/2019 
Target
Name:
Phosphatidylinositol 4,5-bisphosphate 3-kinase catalytic subunit alpha isoform
Synonyms:
PI3-kinase subunit alpha PI3Kalpha Phosphatidylinositol 4,5-bisphosphate 3-kinase 110 kDa catalytic subunit alpha Pik3ca PtdIns-3-kinase subunit p110-alpha p110alpha
Type:
Enzyme Catalytic Domain
Mol. Mass.:
124363.80
Organism:
Rattus norvegicus (Rat)
Description:
A0A0G2K344
Residue:
1068
  
Inhibitor
Name:
BDBM346182
Synonyms:
US10202371, Example 12
Type:
Small organic molecule
Emp. Form.:
C26H28F3N7O6
Mol. Mass.:
591.539
SMILES:
COCCOc1ccc(cc1)[C@@H]1OC(=O)N([C@H]1CO)c1cc(nc(n1)N1CCOCC1)-c1cnc(N)nc1C(F)(F)F
: