Target
Phosphatidylinositol 4,5-bisphosphate 3-kinase catalytic subunit alpha isoform
Ligand
BDBM346186
Substrate
Meas. Tech.
Cellular Assays for PI3Kalpha, Beta and Delta
IC50
606±n/a nM
Citation
 Fairhurst, RAFuret, PKalthoff, FSLerchner, ARueeger, H Oxazolidin-2-one-pyrimidine derivatives and the use thereof as phosphatidylinositol-3-kinase inhibitors US Patent  US10202371 Publication Date 2/12/2019 
Target
Name:
Phosphatidylinositol 4,5-bisphosphate 3-kinase catalytic subunit alpha isoform
Synonyms:
PI3-kinase subunit alpha PI3Kalpha Phosphatidylinositol 4,5-bisphosphate 3-kinase 110 kDa catalytic subunit alpha Pik3ca PtdIns-3-kinase subunit p110-alpha p110alpha
Type:
Enzyme Catalytic Domain
Mol. Mass.:
124363.80
Organism:
Rattus norvegicus (Rat)
Description:
A0A0G2K344
Residue:
1068
  
Inhibitor
Name:
BDBM346186
Synonyms:
WO2007/084786, Compound 18
Type:
Small organic molecule
Emp. Form.:
C22H21F3N8O2
Mol. Mass.:
486.4497
SMILES:
Nc1ncc(-c2cc(nc(n2)N2CCOCC2)N2CCN(C2=O)c2ccccc2)c(n1)C(F)(F)F
: