Target
Phosphatidylinositol 4,5-bisphosphate 3-kinase catalytic subunit beta isoform
Ligand
BDBM346179
Substrate
Meas. Tech.
Cellular Assays for PI3Kalpha, Beta and Delta
IC50
254±n/a nM
Citation
 Fairhurst, RAFuret, PKalthoff, FSLerchner, ARueeger, H Oxazolidin-2-one-pyrimidine derivatives and the use thereof as phosphatidylinositol-3-kinase inhibitors US Patent  US10202371 Publication Date 2/12/2019 
Target
Name:
Phosphatidylinositol 4,5-bisphosphate 3-kinase catalytic subunit beta isoform
Synonyms:
PI3-kinase subunit beta PI3Kbeta Phosphatidylinositol 4,5-bisphosphate 3-kinase 110 kDa catalytic subunit beta PtdIns-3-kinase subunit beta p110beta
Type:
Enzyme Catalytic Domain
Mol. Mass.:
122616.58
Organism:
Rattus norvegicus (Rat)
Description:
Q9Z1L0
Residue:
1070
  
Inhibitor
Name:
BDBM346179
Synonyms:
US10202371, Example 9
Type:
Small organic molecule
Emp. Form.:
C22H21F3N8O3
Mol. Mass.:
502.4491
SMILES:
CC1C(OC(=O)N1c1cc(nc(n1)N1CCOCC1)-c1cnc(N)nc1C(F)(F)F)c1cccnc1
: