Target
Phosphatidylinositol 3-kinase catalytic subunit type 3
Ligand
BDBM346187
Substrate
Meas. Tech.
Human VPS34 Enzyme Assay
IC50
<10±n/a nM
Citation
 Bharathan, ITBlackburn, CCiavarri, JPChouitar, JCullis, CAD Amore, NFleming, PEGigstad, KMGipson, KEGirard, MHu, YLee, JLi, GRezaei, MSintchak, MDSoucy, FStroud, SGVos, TJXu, HYe, Y Heteroaryls and uses thereof US Patent  US10202373 Publication Date 2/12/2019 
Target
Name:
Phosphatidylinositol 3-kinase catalytic subunit type 3
Synonyms:
BC033004 PIK3C3 Phosphatidylinositol 3-kinase catalytic subunit type 3 (PIK3C3) Phosphoinositide 3-Kinase (PI3K), Vps34 PtdIns-3-kinase type 3 hVPS34
Type:
Enzyme
Mol. Mass.:
101551.30
Organism:
Homo sapiens (Human)
Description:
Recombinant human Vps34 protein was expressed as monomeric GST-fusion and purified.
Residue:
887
  
Inhibitor
Name:
BDBM346187
Synonyms:
US10202373, Compound I-1 | US10202373, Example 4D
Type:
Small organic molecule
Emp. Form.:
C16H16N4O5S
Mol. Mass.:
376.387
SMILES:
COC(=O)Nc1cc(ccn1)-c1cnc(OC)c2n(ccc12)S(C)(=O)=O
: