Target
cAMP-dependent protein kinase catalytic subunit alpha
Ligand
BDBM14805
Substrate
Kemptide
Meas. Tech.
PKA Enzymatic Assay
pH
7.5±n/a
Temperature
303.15±n/a K
IC50
>200000±n/a nM
Citation
 Foloppe, NFisher, LMHowes, RKierstan, PPotter, ARobertson, AGSurgenor, AE Structure-based design of novel Chk1 inhibitors: insights into hydrogen bonding and protein-ligand affinity. J Med Chem 48:4332-45 (2005)  
Target
Name:
cAMP-dependent protein kinase catalytic subunit alpha
Synonyms:
KAPCA_HUMAN PKACA cAMP-dependent protein kinase (PKA) cAMP-dependent protein kinase catalytic subunit alpha cAMP-dependent protein kinase catalytic subunit alpha (PKACA) cAMP-dependent protein kinase catalytic subunit alpha isoform 1 | cAMP-dependent protein kinase, alpha-catalytic subunit
Type:
Enzyme Catalytic Subunit
Mol. Mass.:
40598.73
Organism:
Homo sapiens (Human)
Description:
Residue:
351
  
Inhibitor
Name:
BDBM14805
Synonyms:
3-(5,6-Diphenyl-7H-pyrrolo[2,3-d]pyrimidin-4-ylamino)-propane-1,2-diol pyrrolopyrimidine compound 7
Type:
Small organic molecule
Emp. Form.:
C21H20N4O2
Mol. Mass.:
360.4091
SMILES:
OCC(O)CNc1ncnc2[nH]c(c(-c3ccccc3)c12)-c1ccccc1
:
Substrate
Name:
Kemptide
Synonyms:
Aurora Peptide Substrate
Type:
Peptide
Mol. Mass.:
773.92
Organism:
Description:
50 uM ATP as co-substrate.
Residue:
7
LRRASLG