Target
Mitogen-activated protein kinase 14
Ligand
BDBM14838
Substrate
BDBM10852
Meas. Tech.
UV-Thermal Melt
pH
7±n/a
Temperature
298.15±n/a K
Kd
3.4±1.1 nM
Comments
Tm=56.6 C (apo-p38 Tm=46.6 C).
Citation
 Regan, JCapolino, ACirillo, PFGilmore, TGraham, AGHickey, EKroe, RRMadwed, JMoriak, MNelson, RPargellis, CASwinamer, ATorcellini, CTsang, MMoss, N Structure-activity relationships of the p38alpha MAP kinase inhibitor 1-(5-tert-butyl-2-p-tolyl-2H-pyrazol-3-yl)-3-[4-(2-morpholin-4-yl-ethoxy)naph- thalen-1-yl]urea (BIRB 796). J Med Chem 46:4676-86 (2003)  
Target
Name:
Mitogen-activated protein kinase 14
Synonyms:
Crk1 Csbp2 MAP kinase p38 Mapk14 Mitogen-activated protein kinase p38 alpha
Type:
Enzyme
Mol. Mass.:
41281.22
Organism:
Mus musculus (mouse)
Description:
The full-length open reading frame of murine p38 alpha was cloned and expressed in E. coli.. Soluble murine p38R was extracted from cell pellets and purified using ion-exchange chromatography.
Residue:
360
  
Inhibitor
Name:
BDBM14838
Synonyms:
1-(5-iso-Propyl-2-phenyl-2H-pyrazol-3-yl)-3-[4-(2-morpholin-4-yl-ethoxy)-naphthalen-1-yl]-urea BIRB-796 Analog 32 diaryl urea compound 7
Type:
Small organic molecule
Emp. Form.:
C29H33N5O3
Mol. Mass.:
499.604
SMILES:
CC(C)c1cc(NC(=O)Nc2ccc(OCCN3CCOCC3)c3ccccc23)n(n1)-c1ccccc1
:
Substrate