Target
Coagulation factor VII
Ligand
BDBM14863
Substrate
BDBM13777
Meas. Tech.
Enzyme Inhibition Assay
pH
7.4±n/a
Temperature
295.15±n/a K
Ki
13±n/a nM
Citation
 Riggs, JRHu, HKolesnikov, ALeahy, EMWesson, KEShrader, WDVijaykumar, DWahl, TATong, ZSprengeler, PAGreen, MJYu, CKatz, BASanford, ENguyen, MCabuslay, RYoung, WB Novel 5-azaindole factor VIIa inhibitors. Bioorg Med Chem Lett 16:3197-200 (2006)  
Target
Name:
Coagulation factor VII
Synonyms:
Eptacog alfa FA7_HUMAN Factor VIIa (fVIIa) SPCA serum prothrombin conversion accelerator
Type:
Enzyme
Mol. Mass.:
51599.89
Organism:
Homo sapiens (Human)
Description:
Residue:
466
  
Inhibitor
Name:
BDBM14863
Synonyms:
({3-[3-(5-carbamimidoyl-1H-1,3-benzodiazol-2-yl)-2-hydroxyphenyl]-4-hydroxyphenyl}methyl)urea CHEMBL378916
Type:
Small organic molecule
Emp. Form.:
C22H20N6O3
Mol. Mass.:
416.4326
SMILES:
NC(=O)NCc1ccc(O)c(c1)-c1cccc(-c2nc3ccc(cc3[nH]2)C(N)=N)c1O
:
Substrate
Name:
BDBM13777
Synonyms:
(2S)-5-carbamimidamido-2-{2-[(2R)-3-cyclohexyl-2-methanesulfonamidopropanamido]butanamido}-N-(4-nitrophenyl)pentanamide; acetic acid Pefachrome FVIIa
Type:
Small organic molecule
Emp. Form.:
C26H42N8O7S
Mol. Mass.:
610.726
SMILES:
CCC(NC(=O)C(CC1CCCCC1)NS(C)(=O)=O)C(=O)NC(CCC\[NH+]=C(\N)[NH-])C(=O)Nc1ccc(cc1)[N+]([O-])=O
: