Target
Transcription initiation factor TFIID subunit 1 [1504-1635]
Ligand
BDBM346515
Substrate
Meas. Tech.
AF1-BD2 TR-FRET Binding Assay
IC50
26.7±n/a nM
Citation
 Adler, MBurdick, DJCrawford, TDuplessis, MMagnuson, SRNasveschuk, CGRomero, FATang, YTsui, VHWang, S Therapeutic compounds and uses thereof US Patent  US10202378 Publication Date 2/12/2019 
Target
Name:
Transcription initiation factor TFIID subunit 1 [1504-1635]
Synonyms:
BA2R CCGS TAF1-BD2 (11 1504-1635) TAF1_HUMAN | TAF2A
Type:
Enzyme Catalytic Domain
Mol. Mass.:
15296.09
Organism:
Homo sapiens (Human)
Description:
P21675[1504-1635]
Residue:
132
  
Inhibitor
Name:
BDBM346515
Synonyms:
(2-fluorophenyl)methyl 4-(3-hydroxy-3-methyl-but-1-ynyl)-2,6-dimethyl-7-oxo-1H-pyrrolo[2,3-c]pyridine-3-carboxylate | US10202378, Example 119
Type:
Small organic molecule
Emp. Form.:
C22H21FN2O4
Mol. Mass.:
396.4115
SMILES:
Cc1[nH]c2c(c1C(=O)OCc1ccccc1F)c(cn(C)c2=O)C#CC(C)(C)O
: