Target
Transcription initiation factor TFIID subunit 1 [1504-1635]
Ligand
BDBM346587
Substrate
Meas. Tech.
AF1-BD2 TR-FRET Binding Assay
IC50
36.4±n/a nM
Citation
 Adler, MBurdick, DJCrawford, TDuplessis, MMagnuson, SRNasveschuk, CGRomero, FATang, YTsui, VHWang, S Therapeutic compounds and uses thereof US Patent  US10202378 Publication Date 2/12/2019 
Target
Name:
Transcription initiation factor TFIID subunit 1 [1504-1635]
Synonyms:
BA2R CCGS TAF1-BD2 (11 1504-1635) TAF1_HUMAN | TAF2A
Type:
Enzyme Catalytic Domain
Mol. Mass.:
15296.09
Organism:
Homo sapiens (Human)
Description:
P21675[1504-1635]
Residue:
132
  
Inhibitor
Name:
BDBM346587
Synonyms:
4-(3-cyclopropyl-3-hydroxy-but-1-ynyl)-3-(5-isopropyl-1,3,4-oxadiazol-2-yl)-2,6-dimethyl-1H-pyrrolo[2,3-c]pyridin-7-one | US10202378, Example 191
Type:
Small organic molecule
Emp. Form.:
C21H24N4O3
Mol. Mass.:
380.4403
SMILES:
CC(C)c1nnc(o1)-c1c(C)[nH]c2c1c(cn(C)c2=O)C#CC(C)(O)C1CC1
: