Target
Transcription initiation factor TFIID subunit 1
Ligand
BDBM346990
Substrate
Meas. Tech.
CPE Inhibitory Effect Confirming Assay
IC50
14.2±n/a nM
Citation
 Takahashi, CMikamiyama, HAkiyama, TTomita, KTaoda, YKawai, MAnan, KMiyagawa, M Substituted polycyclic carbamoyl pyridone derivative prodrug US Patent  US10202379 Publication Date 2/12/2019 
Target
Name:
Transcription initiation factor TFIID subunit 1
Synonyms:
BA2R CCG1 Cell cycle gene 1 protein TAF1 TAF2A TAFII250 Transcription initiation factor TFIID 250 kDa subunit p250
Type:
PROTEIN
Mol. Mass.:
212598.75
Organism:
Homo sapiens (Human)
Description:
ChEMBL_108248
Residue:
1872
  
Inhibitor
Name:
BDBM346990
Synonyms:
US10202379, Reference Example 752
Type:
Small organic molecule
Emp. Form.:
C26H25F3N4O3S
Mol. Mass.:
530.562
SMILES:
C[C@@H](N1CN([C@@H]2c3ccccc3SCc3cccc(N(C)C)c23)n2ccc(=O)c(O)c2C1=O)C(F)(F)F
: