Target
Transcription initiation factor TFIID subunit 1
Ligand
BDBM346995
Substrate
Meas. Tech.
CPE Inhibitory Effect Confirming Assay
IC50
5.22±n/a nM
Citation
 Takahashi, CMikamiyama, HAkiyama, TTomita, KTaoda, YKawai, MAnan, KMiyagawa, M Substituted polycyclic carbamoyl pyridone derivative prodrug US Patent  US10202379 Publication Date 2/12/2019 
Target
Name:
Transcription initiation factor TFIID subunit 1
Synonyms:
BA2R CCG1 Cell cycle gene 1 protein TAF1 TAF2A TAFII250 Transcription initiation factor TFIID 250 kDa subunit p250
Type:
PROTEIN
Mol. Mass.:
212598.75
Organism:
Homo sapiens (Human)
Description:
ChEMBL_108248
Residue:
1872
  
Inhibitor
Name:
BDBM346995
Synonyms:
US10202379, Reference Example 772
Type:
Small organic molecule
Emp. Form.:
C24H18ClF4N3O3S
Mol. Mass.:
539.93
SMILES:
C[C@@H](N1CN([C@@H]2c3ccc(F)cc3SCc3cccc(Cl)c23)n2ccc(=O)c(O)c2C1=O)C(F)(F)F
: