Target
Lysine-specific demethylase 4C
Ligand
BDBM296081
Substrate
Meas. Tech.
JMJD2C Assay
IC50
5500±n/a nM
Citation
 Boloor, AKanouni, TStafford, JAVeal, JMWallace, MB Histone demethylase inhibitors US Patent  US10202381 Publication Date 2/12/2019 
Target
Name:
Lysine-specific demethylase 4C
Synonyms:
GASC-1 protein Gene amplified in squamous cell carcinoma 1 protein JMJD2C Jumonji domain-containing protein 2C KDM4C_HUMAN | KIAA0780
Type:
Protein
Mol. Mass.:
119979.01
Organism:
Homo sapiens (Human)
Description:
Q9H3R0
Residue:
1056
  
Inhibitor
Name:
BDBM296081
Synonyms:
2-[3-(benzyl-methyl-amino)-phenoxy]- pyrido[3,4-d]pyrimidin-4-ol US10202381, Example 9 US10611763, Example 9 US11535616, Example 9
Type:
Small organic molecule
Emp. Form.:
C21H18N4O2
Mol. Mass.:
358.3932
SMILES:
CN(Cc1ccccc1)c1cccc(Oc2nc(O)c3ccncc3n2)c1
: