Target
Lysine-specific demethylase 4C
Ligand
BDBM296133
Substrate
Meas. Tech.
JMJD2C Assay
IC50
550±n/a nM
Citation
 Boloor, AKanouni, TStafford, JAVeal, JMWallace, MB Histone demethylase inhibitors US Patent  US10202381 Publication Date 2/12/2019 
Target
Name:
Lysine-specific demethylase 4C
Synonyms:
GASC-1 protein Gene amplified in squamous cell carcinoma 1 protein JMJD2C Jumonji domain-containing protein 2C KDM4C_HUMAN | KIAA0780
Type:
Protein
Mol. Mass.:
119979.01
Organism:
Homo sapiens (Human)
Description:
Q9H3R0
Residue:
1056
  
Inhibitor
Name:
BDBM296133
Synonyms:
2-[4-(N-methyl-4- methylsulfonylanilino)phenoxy]pyrido[3,4- d]pyrimidin-4-ol US10202381, Example 57 US10611763, Example 57 US11535616, Example 57
Type:
Small organic molecule
Emp. Form.:
C21H18N4O4S
Mol. Mass.:
422.457
SMILES:
CN(c1ccc(Oc2nc(O)c3ccncc3n2)cc1)c1ccc(cc1)S(C)(=O)=O
: