Target
Lysine-specific demethylase 4C
Ligand
BDBM296180
Substrate
Meas. Tech.
JMJD2C Assay
IC50
5500±n/a nM
Citation
 Boloor, AKanouni, TStafford, JAVeal, JMWallace, MB Histone demethylase inhibitors US Patent  US10202381 Publication Date 2/12/2019 
Target
Name:
Lysine-specific demethylase 4C
Synonyms:
GASC-1 protein Gene amplified in squamous cell carcinoma 1 protein JMJD2C Jumonji domain-containing protein 2C KDM4C_HUMAN | KIAA0780
Type:
Protein
Mol. Mass.:
119979.01
Organism:
Homo sapiens (Human)
Description:
Q9H3R0
Residue:
1056
  
Inhibitor
Name:
BDBM296180
Synonyms:
2-(1-phenylindol-5-yl)oxypyrido[3,4- d]pyrimidin-4-ol US10202381, Example 103 US10611763, Example 103 US11535616, Example 103
Type:
Small organic molecule
Emp. Form.:
C21H14N4O2
Mol. Mass.:
354.3615
SMILES:
Oc1nc(Oc2ccc3n(ccc3c2)-c2ccccc2)nc2cnccc12
: