Target
Lysine-specific demethylase 4C
Ligand
BDBM347118
Substrate
Meas. Tech.
JMJD2C Assay
IC50
5500±n/a nM
Citation
 Boloor, AKanouni, TStafford, JAVeal, JMWallace, MB Histone demethylase inhibitors US Patent  US10202381 Publication Date 2/12/2019 
Target
Name:
Lysine-specific demethylase 4C
Synonyms:
GASC-1 protein Gene amplified in squamous cell carcinoma 1 protein JMJD2C Jumonji domain-containing protein 2C KDM4C_HUMAN | KIAA0780
Type:
Protein
Mol. Mass.:
119979.01
Organism:
Homo sapiens (Human)
Description:
Q9H3R0
Residue:
1056
  
Inhibitor
Name:
BDBM347118
Synonyms:
2-(4-(cyclopentyl(4-isopropylphenyl)amino) phenoxy)pyrido[3,4-d] pyrimidin-4-ol US10208039, Example 125
Type:
Small organic molecule
Emp. Form.:
C27H28N4O2
Mol. Mass.:
440.5368
SMILES:
CC(C)c1ccc(cc1)N(C1CCCC1)c1ccc(Oc2nc(O)c3ccncc3n2)cc1
: