Target
Indoleamine 2,3-dioxygenase 1
Ligand
BDBM347041
Substrate
Meas. Tech.
IDO1 Enzymatic Assay
IC50
<100±n/a nM
Citation
 Li, QGao, D Fused-ring compounds, pharmaceutical composition and uses thereof US Patent  US10202388 Publication Date 2/12/2019 
Target
Name:
Indoleamine 2,3-dioxygenase 1
Synonyms:
I23O1_HUMAN IDO-1 INDO Indoleamine 2,3-dioxygenase | Indoleamine-pyrrole 2,3-dioxygenase
Type:
Enzyme
Mol. Mass.:
45330.80
Organism:
Homo sapiens (Human)
Description:
P14902
Residue:
403
  
Inhibitor
Name:
BDBM347041
Synonyms:
US10202388, Compound 55
Type:
Small organic molecule
Emp. Form.:
C29H31FN4O2
Mol. Mass.:
486.5804
SMILES:
OC(CC1c2c(cccc2F)-c2cncn12)C12CC3CC(C1)C(NC(=O)Nc1ccccc1)C(C3)C2
: