Target
Tryptophan 2,3-dioxygenase
Ligand
BDBM347022
Substrate
Meas. Tech.
TDO2 Enzymatic Assay
IC50
300±n/a nM
Citation
 Li, QGao, D Fused-ring compounds, pharmaceutical composition and uses thereof US Patent  US10202388 Publication Date 2/12/2019 
Target
Name:
Tryptophan 2,3-dioxygenase
Synonyms:
T23O_HUMAN TDO2 TRPO Tryptophan oxygenase Tryptophanase
Type:
PROTEIN
Mol. Mass.:
47874.48
Organism:
Homo sapiens (Human)
Description:
ChEMBL_825691
Residue:
406
  
Inhibitor
Name:
BDBM347022
Synonyms:
US10202388, Compound 23A-2 | US10202388, Compound 26A-3
Type:
Small organic molecule
Emp. Form.:
C22H25FN2O2
Mol. Mass.:
368.4445
SMILES:
O[C@H](CC1c2c(cccc2F)-c2cncn12)C12CC3CC(C1)[C@H](O)C(C3)C2
: