Target
Ubiquitin-like modifier-activating enzyme 1
Ligand
BDBM329812
Substrate
Meas. Tech.
Ubiquitin Activating Enzyme (UAE) HTRF Assay
IC50
<10±n/a nM
Citation
 Afroze, RBharathan, ITCiavarri, JPFleming, PEGaulin, JLGirard, MLangston, SPSoucy, FWong, TYe, Y Pyrazolopyrimidinyl inhibitors of ubiquitin-activating enzyme US Patent  US10202389 Publication Date 2/12/2019 
Target
Name:
Ubiquitin-like modifier-activating enzyme 1
Synonyms:
A1S9T UBA1_HUMAN | UBE1
Type:
PROTEIN
Mol. Mass.:
117834.03
Organism:
Homo sapiens (Human)
Description:
ChEMBL_827630
Residue:
1058
  
Inhibitor
Name:
BDBM329812
Synonyms:
(rac)-((1R,2R,3S,4R)-4-(2-(5-chloro-2-methoxyphenyl)pyrazolo[1,5-a]pyrimidin-7- US9663525, Compound I-020 | US9796725, Compound I-020
Type:
Small organic molecule
Emp. Form.:
C19H22ClN5O6S
Mol. Mass.:
483.926
SMILES:
COc1ccc(Cl)cc1-c1cc2nccc(N[C@@H]3C[C@H](COS(N)(=O)=O)[C@@H](O)[C@H]3O)n2n1
: