Target
Ubiquitin-like modifier-activating enzyme 1
Ligand
BDBM329826
Substrate
Meas. Tech.
Ubiquitin Activating Enzyme (UAE) HTRF Assay
IC50
<10±n/a nM
Citation
 Afroze, RBharathan, ITCiavarri, JPFleming, PEGaulin, JLGirard, MLangston, SPSoucy, FWong, TYe, Y Pyrazolopyrimidinyl inhibitors of ubiquitin-activating enzyme US Patent  US10202389 Publication Date 2/12/2019 
Target
Name:
Ubiquitin-like modifier-activating enzyme 1
Synonyms:
A1S9T UBA1_HUMAN | UBE1
Type:
PROTEIN
Mol. Mass.:
117834.03
Organism:
Homo sapiens (Human)
Description:
ChEMBL_827630
Residue:
1058
  
Inhibitor
Name:
BDBM329826
Synonyms:
(rac)-((1R,2R,3S,4R)-2,3-dihydroxy-4-(2-(quinolin-6-yl)pyrazolo[1,5-a]pyrimidin-7- US9663525, Compound I-034 | US9796725, Compound I-034
Type:
Small organic molecule
Emp. Form.:
C21H22N6O5S
Mol. Mass.:
470.502
SMILES:
NS(=O)(=O)OC[C@H]1C[C@@H](Nc2ccnc3cc(nn23)-c2ccc3ncccc3c2)[C@H](O)[C@@H]1O
: