Target
Ubiquitin-like modifier-activating enzyme 1
Ligand
BDBM329884
Substrate
Meas. Tech.
Ubiquitin Activating Enzyme (UAE) HTRF Assay
IC50
<10±n/a nM
Citation
 Afroze, RBharathan, ITCiavarri, JPFleming, PEGaulin, JLGirard, MLangston, SPSoucy, FWong, TYe, Y Pyrazolopyrimidinyl inhibitors of ubiquitin-activating enzyme US Patent  US10202389 Publication Date 2/12/2019 
Target
Name:
Ubiquitin-like modifier-activating enzyme 1
Synonyms:
A1S9T UBA1_HUMAN | UBE1
Type:
PROTEIN
Mol. Mass.:
117834.03
Organism:
Homo sapiens (Human)
Description:
ChEMBL_827630
Residue:
1058
  
Inhibitor
Name:
BDBM329884
Synonyms:
(rac)-((1R,2R,3S,4R)-4-(2-(5-chlorobenzofuran-3-yl)pyrazolo[1,5-a]pyrimidin-7- US9663525, Compound I-092 | US9796725, Compound I-092
Type:
Small organic molecule
Emp. Form.:
C20H20ClN5O6S
Mol. Mass.:
493.921
SMILES:
NS(=O)(=O)OC[C@H]1C[C@@H](Nc2ccnc3cc(nn23)-c2coc3ccc(Cl)cc23)[C@H](O)[C@@H]1O
: