Target
Ubiquitin-like modifier-activating enzyme 1
Ligand
BDBM329906
Substrate
Meas. Tech.
Ubiquitin Activating Enzyme (UAE) HTRF Assay
IC50
<10±n/a nM
Citation
 Afroze, RBharathan, ITCiavarri, JPFleming, PEGaulin, JLGirard, MLangston, SPSoucy, FWong, TYe, Y Pyrazolopyrimidinyl inhibitors of ubiquitin-activating enzyme US Patent  US10202389 Publication Date 2/12/2019 
Target
Name:
Ubiquitin-like modifier-activating enzyme 1
Synonyms:
A1S9T UBA1_HUMAN | UBE1
Type:
PROTEIN
Mol. Mass.:
117834.03
Organism:
Homo sapiens (Human)
Description:
ChEMBL_827630
Residue:
1058
  
Inhibitor
Name:
BDBM329906
Synonyms:
(s.e.)-((1R,2R,3S,4R)-2,3-dihydroxy-4-(2-(2-methylnaphthalen-1-yl)pyrazolo[1,5- US9663525, Compound I-114 | US9796725, Compound I-114
Type:
Small organic molecule
Emp. Form.:
C23H25N5O5S
Mol. Mass.:
483.54
SMILES:
Cc1ccc2ccccc2c1-c1cc2nccc(N[C@@H]3C[C@H](COS(N)(=O)=O)[C@@H](O)[C@H]3O)n2n1
: