Target
D-amino-acid oxidase
Ligand
BDBM50431079
Substrate
Meas. Tech.
DAAO Inhibitory Activity Assay
IC50
3.90±n/a nM
Citation
 Hondo, TNakanishi, KNiimi, TWarizaya, MNamatame, IHarada, K Dihydroxy aromatic heterocyclic compound US Patent  US10202399 Publication Date 2/12/2019 
Target
Name:
D-amino-acid oxidase
Synonyms:
D-amino-acid oxidase (DAAO) DAMOX OXDA_HUMAN
Type:
Homodimer
Mol. Mass.:
39476.06
Organism:
Homo sapiens (Human)
Description:
P14920
Residue:
347
  
Inhibitor
Name:
BDBM50431079
Synonyms:
CHEMBL2338785 US9180122, 27 | US9212147, 9
Type:
Small organic molecule
Emp. Form.:
C13H13NO2
Mol. Mass.:
215.2478
SMILES:
Oc1cc(CCc2ccccc2)c[nH]c1=O
: