Target
D-amino-acid oxidase
Ligand
BDBM196667
Substrate
Meas. Tech.
DAAO Inhibitory Activity Assay
IC50
6.90±n/a nM
Citation
 Hondo, TNakanishi, KNiimi, TWarizaya, MNamatame, IHarada, K Dihydroxy aromatic heterocyclic compound US Patent  US10202399 Publication Date 2/12/2019 
Target
Name:
D-amino-acid oxidase
Synonyms:
D-amino-acid oxidase (DAAO) DAMOX OXDA_HUMAN
Type:
Homodimer
Mol. Mass.:
39476.06
Organism:
Homo sapiens (Human)
Description:
P14920
Residue:
347
  
Inhibitor
Name:
BDBM196667
Synonyms:
US10202399, Example 29 | US9212147, 29
Type:
Small organic molecule
Emp. Form.:
C8H12N2O2
Mol. Mass.:
168.1931
SMILES:
CCCCc1cc(O)c(=O)[nH]n1
: