Target
D-amino-acid oxidase
Ligand
BDBM196670
Substrate
Meas. Tech.
DAAO Inhibitory Activity Assay
IC50
2.50±n/a nM
Citation
 Hondo, TNakanishi, KNiimi, TWarizaya, MNamatame, IHarada, K Dihydroxy aromatic heterocyclic compound US Patent  US10202399 Publication Date 2/12/2019 
Target
Name:
D-amino-acid oxidase
Synonyms:
D-amino-acid oxidase (DAAO) DAMOX OXDA_HUMAN
Type:
Homodimer
Mol. Mass.:
39476.06
Organism:
Homo sapiens (Human)
Description:
P14920
Residue:
347
  
Inhibitor
Name:
BDBM196670
Synonyms:
US10202399, Example 52 | US9212147, 52
Type:
Small organic molecule
Emp. Form.:
C14H16N2O2
Mol. Mass.:
244.289
SMILES:
Oc1cc(CCCCc2ccccc2)n[nH]c1=O
: