Target
D-amino-acid oxidase
Ligand
BDBM196671
Substrate
Meas. Tech.
DAAO Inhibitory Activity Assay
IC50
2.30±n/a nM
Citation
 Hondo, TNakanishi, KNiimi, TWarizaya, MNamatame, IHarada, K Dihydroxy aromatic heterocyclic compound US Patent  US10202399 Publication Date 2/12/2019 
Target
Name:
D-amino-acid oxidase
Synonyms:
D-amino-acid oxidase (DAAO) DAMOX OXDA_HUMAN
Type:
Homodimer
Mol. Mass.:
39476.06
Organism:
Homo sapiens (Human)
Description:
P14920
Residue:
347
  
Inhibitor
Name:
BDBM196671
Synonyms:
US10202399, Example 56 | US9212147, 56
Type:
Small organic molecule
Emp. Form.:
C16H14N2O2
Mol. Mass.:
266.2946
SMILES:
Oc1cc(CCc2cccc3ccccc23)n[nH]c1=O
: