Target
D-amino-acid oxidase
Ligand
BDBM347109
Substrate
Meas. Tech.
DAAO Inhibitory Activity Assay
IC50
2.70±n/a nM
Citation
 Hondo, TNakanishi, KNiimi, TWarizaya, MNamatame, IHarada, K Dihydroxy aromatic heterocyclic compound US Patent  US10202399 Publication Date 2/12/2019 
Target
Name:
D-amino-acid oxidase
Synonyms:
D-amino-acid oxidase (DAAO) DAMOX OXDA_HUMAN
Type:
Homodimer
Mol. Mass.:
39476.06
Organism:
Homo sapiens (Human)
Description:
P14920
Residue:
347
  
Inhibitor
Name:
BDBM347109
Synonyms:
US10202399, Example 254
Type:
Small organic molecule
Emp. Form.:
C11H9ClN2O3
Mol. Mass.:
252.654
SMILES:
Oc1cc(COc2ccc(Cl)cc2)n[nH]c1=O
: