Target
Insulin receptor
Ligand
BDBM2580
Substrate
Peptide Substrate
Meas. Tech.
Homogeneous Time-Resolved Fluorescence (HTRF) Assay
pH
7.4±n/a
Temperature
295.15±n/a K
IC50
210±50 nM
Citation
 Bell, IMStirdivant, SMAhern, JCulberson, JCDarke, PLDinsmore, CJDrakas, RAGallicchio, SNGraham, SLHeimbrook, DCHall, DLHua, JKett, NRKim, ASKornienko, MKuo, LCMunshi, SKQuigley, AGReid, JCTrotter, BWWaxman, LHWilliams, TMZartman, CB Biochemical and structural characterization of a novel class of inhibitors of the type 1 insulin-like growth factor and insulin receptor kinases. Biochemistry 44:9430-40 (2005)  
Target
Name:
Insulin receptor
Synonyms:
INSR INSR_HUMAN Insulin receptor beta subunit
Type:
Receptor Tyrosine Kinase
Mol. Mass.:
156322.60
Organism:
Homo sapiens (Human)
Description:
P06213
Residue:
1382
  
Inhibitor
Name:
BDBM2580
Synonyms:
K252a | methyl (15R,16S,18S)-16-hydroxy-15-methyl-3-oxo-28-oxa-4,14,19-triazaoctacyclo[12.11.2.1^{15,18}.0^{2,6}.0^{7,27}.0^{8,13}.0^{19,26}.0^{20,25}]octacosa-1(26),2(6),7(27),8(13),9,11,20(25),21,23-nonaene-16-carboxylate
Type:
Small organic molecule
Emp. Form.:
C27H21N3O5
Mol. Mass.:
467.4727
SMILES:
COC(=O)[C@]1(O)C[C@@H]2O[C@@]1(C)n1c3ccccc3c3c4CNC(=O)c4c4c5ccccc5n2c4c13
:
Substrate
Name:
Peptide Substrate
Synonyms:
Type:
Peptide
Mol. Mass.:
2600.09
Organism:
Description:
Residue:
21