Target
Genome polyprotein
Ligand
BDBM347094
Substrate
Meas. Tech.
HCV NS5B RdRp enzyme assay
EC50
>10000±n/a nM
Citation
 Wang, TZhang, ZKadow, JF Macrocyclic benzofuran compounds for the treatment of hepatitis C US Patent  US10202403 Publication Date 2/12/2019 
Target
Name:
Genome polyprotein
Synonyms:
HCV Polymerase (S282T) NS3/4A Protein POLG_HCVJA
Type:
Protein
Mol. Mass.:
327076.78
Organism:
Hepatitis C Virus (Virus)
Description:
P26662
Residue:
3010
  
Inhibitor
Name:
BDBM347094
Synonyms:
US10202403, Compound 2004
Type:
Small organic molecule
Emp. Form.:
C48H36F2N2O6
Mol. Mass.:
774.806
SMILES:
CNC(=O)c1c(oc2ccc3OCc4cccc(Cc5c(OCc6cccc(Cc3c12)c6)ccc1oc(c(C(=O)NC)c51)-c1ccc(F)cc1)c4)-c1ccc(F)cc1
: