Target
Gag-Pol polyprotein
Ligand
BDBM347167
Substrate
Meas. Tech.
Anti-HIV Activity
EC50
1.60±n/a nM
Citation
 Yoshinaga, TNodu, K Polycyclic pyridone derivative having integrase inhibitory activity US Patent  US10202404 Publication Date 2/12/2019 
Target
Name:
Gag-Pol polyprotein
Synonyms:
HIV-1 reverse transcriptase (HIV-1 RT) POL_HV1H2 Protease Reverse transcriptase (RT) gag-pol p66 RT
Type:
Protein
Mol. Mass.:
162074.74
Organism:
Human immunodeficiency virus type 1 group M subtype B (isolate HXB2)
Description:
P04585
Residue:
1435
  
Inhibitor
Name:
BDBM347167
Synonyms:
US10202404, Compound A-39
Type:
Small organic molecule
Emp. Form.:
C22H18F2N4O4S
Mol. Mass.:
472.465
SMILES:
Oc1c2C(=O)N3[C@@H](Cn2cc(-c2nnc(Cc4ccc(F)cc4F)s2)c1=O)O[C@@H]1CCC[C@H]31
: