Target
Gag-Pol polyprotein
Ligand
BDBM347174
Substrate
Meas. Tech.
Anti-HIV Activity
EC50
3.40±n/a nM
Citation
 Yoshinaga, TNodu, K Polycyclic pyridone derivative having integrase inhibitory activity US Patent  US10202404 Publication Date 2/12/2019 
Target
Name:
Gag-Pol polyprotein
Synonyms:
HIV-1 reverse transcriptase (HIV-1 RT) POL_HV1H2 Protease Reverse transcriptase (RT) gag-pol p66 RT
Type:
Protein
Mol. Mass.:
162074.74
Organism:
Human immunodeficiency virus type 1 group M subtype B (isolate HXB2)
Description:
P04585
Residue:
1435
  
Inhibitor
Name:
BDBM347174
Synonyms:
US10202404, Compound A-47
Type:
Small organic molecule
Emp. Form.:
C22H19F2N3O4S
Mol. Mass.:
459.466
SMILES:
C[C@H]1CO[C@@H]2Cn3cc(-c4nc(C)c(Cc5ccc(F)cc5F)s4)c(=O)c(O)c3C(=O)N12
: