Target
Gag-Pol polyprotein
Ligand
BDBM347182
Substrate
Meas. Tech.
Anti-HIV Activity
EC50
1.70±n/a nM
Citation
 Yoshinaga, TNodu, K Polycyclic pyridone derivative having integrase inhibitory activity US Patent  US10202404 Publication Date 2/12/2019 
Target
Name:
Gag-Pol polyprotein
Synonyms:
HIV-1 reverse transcriptase (HIV-1 RT) POL_HV1H2 Protease Reverse transcriptase (RT) gag-pol p66 RT
Type:
Protein
Mol. Mass.:
162074.74
Organism:
Human immunodeficiency virus type 1 group M subtype B (isolate HXB2)
Description:
P04585
Residue:
1435
  
Inhibitor
Name:
BDBM347182
Synonyms:
US10202404, Compound A-55
Type:
Small organic molecule
Emp. Form.:
C22H19F2N5O3S
Mol. Mass.:
471.48
SMILES:
Oc1c2C(=O)N3C[C@H]4CCCN4[C@@H]3Cn2cc(-c2nnc(Cc3ccc(F)cc3F)s2)c1=O
: