Target
Gag-Pol polyprotein
Ligand
BDBM347245
Substrate
Meas. Tech.
Anti-HIV Activity
EC50
1.70±n/a nM
Citation
 Yoshinaga, TNodu, K Polycyclic pyridone derivative having integrase inhibitory activity US Patent  US10202404 Publication Date 2/12/2019 
Target
Name:
Gag-Pol polyprotein
Synonyms:
HIV-1 reverse transcriptase (HIV-1 RT) POL_HV1H2 Protease Reverse transcriptase (RT) gag-pol p66 RT
Type:
Protein
Mol. Mass.:
162074.74
Organism:
Human immunodeficiency virus type 1 group M subtype B (isolate HXB2)
Description:
P04585
Residue:
1435
  
Inhibitor
Name:
BDBM347245
Synonyms:
US10202404, Compound C-20
Type:
Small organic molecule
Emp. Form.:
C20H19F2N5O4S
Mol. Mass.:
463.458
SMILES:
COCCN1N(C)Cn2cc(-c3nnc(Cc4ccc(F)cc4F)s3)c(=O)c(O)c2C1=O
: