Target
Genome polyprotein [S283T]
Ligand
BDBM347265
Substrate
Meas. Tech.
HCV Polymerase Enzyme Assay
IC50
<250±n/a nM
Citation
 Dukhan, DDousson, CBGosselin, GPaparin, JBrandt, GRahali, RSalanson, AAlexandre, F 3′-substituted methyl or alkynyl nucleosides nucleotides for the treatment of HCV US Patent  US10202411 Publication Date 2/12/2019 
Target
Name:
Genome polyprotein [S283T]
Synonyms:
HCV NS5B Mutant(S283T) | POLG_HCVJA
Type:
Enzyme Catalytic Domain
Mol. Mass.:
327090.80
Organism:
Hepatitis C virus genotype 1b (isolate Japanese) (HCV)
Description:
P26662[S283T]
Residue:
3010
  
Inhibitor
Name:
BDBM347265
Synonyms:
US10202411, Compound 327
Type:
Small organic molecule
Emp. Form.:
C11H17FN5O13P3
Mol. Mass.:
539.1981
SMILES:
Nc1nc2n(cnc2c(=O)[nH]1)[C@@H]1O[C@H](COP(O)(=O)OP(O)(=O)OP(O)(O)=O)[C@@H](CF)[C@H]1O
: