Target
Protein M2-1
Ligand
BDBM347277
Substrate
Meas. Tech.
Cytopathic Effect Assay with RSV A2 in HEp-2 Cells
EC50
>100000±n/a nM
Citation
 Sommadossi, JMoussa, A β-D-2′-deoxy-2′-substituted-4′-substituted-2-substituted-N6-substituted-6-aminopurinenucleotides for the treatment of paramyxovirus and orthomyxovirus infections US Patent  US10202412 Publication Date 2/12/2019 
Target
Name:
Protein M2-1
Synonyms:
Envelope-associated 22 kDa protein M21_HRSVA | Matrix M2-1
Type:
Enzyme Catalytic Domain
Mol. Mass.:
22163.59
Organism:
Human respiratory syncytial virus A (strain A2)
Description:
P04545
Residue:
194
  
Inhibitor
Name:
BDBM347277
Synonyms:
US10202412, Compound O
Type:
Small organic molecule
Emp. Form.:
C14H21FN6O3
Mol. Mass.:
340.3533
SMILES:
CC[C@]1(CO)O[C@H]([C@H](F)[C@@H]1O)n1cnc2c(nc(N)nc12)N(C)C
: