Target
RAC-alpha serine/threonine-protein kinase [139-480,S378A,S381A,T450D,S473D]
Ligand
BDBM15067
Substrate
biotinylated Akt peptide substrate
Meas. Tech.
Akt Kinase Assay
pH
7.5±n/a
Temperature
295.15±n/a K
Ki
2±n/a nM
Citation
 Thomas, SALi, TWoods, KWSong, XPackard, GFischer, JPDiebold, RBLiu, XShi, YKlinghofer, VJohnson, EFBouska, JJOlson, AGuan, RMagnone, SRMarsh, KLuo, YRosenberg, SHGiranda, VLLi, Q Identification of a novel 3,5-disubstituted pyridine as a potent, selective, and orally active inhibitor of Akt1 kinase. Bioorg Med Chem Lett 16:3740-4 (2006)  
Target
Name:
RAC-alpha serine/threonine-protein kinase [139-480,S378A,S381A,T450D,S473D]
Synonyms:
AKT1 C-AKT Protein kinase B (Akt 1) RAC | RAC-PK-alpha
Type:
Enzyme
Mol. Mass.:
39513.28
Organism:
Homo sapiens (Human)
Description:
Recombinant His-tagged Akt1 (S378A, S381A, T450D, S473D; 139-480)
Residue:
342
  
Inhibitor
Name:
BDBM15067
Synonyms:
(2S)-1-(1H-indol-3-yl)-3-(5-isoquinolin-6-ylpyridin-3-yl)oxy-propan-2-amine 5-isoquinolinyl pyridine 2 isoquinoline-pyridine, 1 pyridine-base inhibitor 13a
Type:
Small organic molecule
Emp. Form.:
C25H22N4O
Mol. Mass.:
394.4684
SMILES:
N[C@H](COc1cncc(c1)-c1ccc2cnccc2c1)Cc1c[nH]c2ccccc12
:
Substrate
Name:
biotinylated Akt peptide substrate
Synonyms:
Type:
Biotinylated Peptide
Mol. Mass.:
3178.04
Organism:
Description:
Km=15 uM
Residue:
28